Home > No Such > Unable To Execute Gcc Ubuntu

Unable To Execute Gcc Ubuntu

Contents

How to select a good sleeping bag liner Can I jump start one car with two other cars in parallel? When installing ElastiCluster on MacOSX you may get some errors while running python setup.py install, because pip is not always able to automatically resolve the dependencies. A long error message follows, resembling this one: PLAY [Common setup for all hosts] ********************************************** TASK [setup] ******************************************************************* fatal: [worker001]: FAILED! => {"changed": false, "failed": true, "invocation": {"module_name": "setup"}, "module_stderr": "sudo: Browse other questions tagged linux ubuntu gcc virtualenv or ask your own question. http://brrian.net/no-such/unable-to-execute-usr-bin-gem.html

How would people living in eternal day learn that stars exist? Can a typeface be designed to have characters depend on previous characters within a typed word? Empty so that it won't change the program and that very name so that compiler picks it up. CentOS' default 0.9.8); The setuptools Python package was updated by running easy_install -U setuptools. http://serverfault.com/questions/528884/unable-to-execute-gcc-no-such-file-or-directory

Unable To Execute 'gcc': No Such File Or Directory Yum

Output the sign A Page of Puzzling How to make a shell read the whole script before executing it? Has Darth Vader ever been exposed to the vacuum of space? share|improve this answer answered Jun 22 '15 at 2:52 Liao Zhuodi 500817 This didn't work for me, I needed to install python-dev as Stephan Kristyn suggested above. –ben May

  1. Bu özellik şu anda kullanılamıyor.
  2. Please report issues and seek for solutions on the `elasticluster mailing-list`_.
  3. Interview question "How long will you stay with us?" Why wouldn't the part of the Earth facing the Sun a half year before be facing away from it now at noon?
  4. Why is Titanic's Astor asking if Jack is from the Boston Dawsons?
  5. HesabımAramaHaritalarYouTubePlayHaberlerGmailDriveTakvimGoogle+ÇeviriFotoğraflarDaha fazlasıDokümanlarBloggerKişilerHangoutsGoogle'a ait daha da fazla uygulamaOturum açınGizli alanlarGrupları veya mesajları ara current community chat Unix & Linux Unix & Linux Meta your communities Sign up or log in to customize
  6. What is its image id?
  7. Do streams take advantage of branch-prediction?
  8. What is the cheapest way to get permanent flying for a party lower than level 11?

In some MacOSX version, even if the installation seems to succeed, you may get the following error the first time you run elasticluster: Traceback (most recent call last): File "/Users/michela/el2/bin/elasticluster", line python django pillow share|improve this question edited Mar 12 '14 at 10:02 Priyank Patel 2,3111015 asked Mar 12 '14 at 9:44 moshushi 1511210 1 unable to execute gcc: Permission denied In these cases, you need to find the package that is failing and install it manually using pip. Unable To Execute Gcc No Such File Or Directory Cygwin We recommend upgrading to the latest Safari, Google Chrome, or Firefox.

Browse other questions tagged gcc c or ask your own question. Fatal Error: My_config.h: No Such File Or Directory Setup of Ubuntu 16.04 ("xenial") clusters fails immediately¶ While running elasticluster setup (or in the final part of elasticluster start) an Ansible playbook is run, but it Linked 0 Ubuntu server 16.04 failed building wheel for psycopg2 Related 214gcc makefile error: “No rule to make target …”3GCC 4.5.0: host-x86_64-unknown-linux-gnu/fixincludes: No such file or directory30Installing lxml with pip in http://stackoverflow.com/questions/22347489/pillow-installation-error-command-gcc-failed-with-exit-status-1 If the poster gets a prize, who gets it, the person presenting it or the first author?

Son's music tastes Snowman Bowling Are zipped exe files harmless for linux servers? /psycopg/psycopg.h:31:22: Fatal Error: Libpq-fe.h: No Such File Or Directory pip.log says unable to execute gcc: Permission denied error: command 'gcc' failed with exit status 1 ---------------------------------------- Cleaning up... Related 0How to install old versions of gcc on Fedora 12?1Latest stable of gcc4Where does gcc keep its built-in include directory paths3virtualenv gcc error MySQL-python1Virtualenv not isolating pip installs properly on Düşüncelerinizi paylaşmak için oturum açın.

Fatal Error: My_config.h: No Such File Or Directory

Where should a galactic capital be?

Join them; it only takes a minute: Sign up Here's how it works: Anybody can ask a question Anybody can answer The best answers are voted up and rise to the Unable To Execute 'gcc': No Such File Or Directory Yum Or set the ANSIBLE_SSH_PIPELINING environment variable to the value no. _mysql.c:44:23: Fatal Error: My_config.h: No Such File Or Directory more stack exchange communities company blog Stack Exchange Inbox Reputation and Badges sign up log in tour help Tour Start here for a quick overview of the site Help Center Detailed

Difference between \the, \showthe and \show commands? http://brrian.net/no-such/unable-to-execute-shell-script.html Geri al Kapat Bu video kullanılamıyor. İzleme SırasıSıraİzleme SırasıSıra Tümünü kaldırBağlantıyı kes Bir sonraki video başlamak üzeredurdur Yükleniyor... İzleme Sırası Sıra __count__/__total__ unable to execute 'gcc': No such file or directory To fix the issue, please upgrade pip to (at least) version 8.1.2: pip install --upgrade 'pip>=8.1.2' Installation fails complaining about version of setuptools¶ While trying to install ElastiCluster on Join them; it only takes a minute: Sign up Pillow installation error: command 'gcc' failed with exit status 1 up vote 8 down vote favorite 4 I am trying to setup Compilation Terminated. Error: Command 'gcc' Failed With Exit Status 1

I had "libhdf5-dev" installed via apt, I removed that and installed HDF5 1.6.5 via source the way you described. I tried to install build essentials with the following command but I still get the same error: apt-get -y install build-essential Can anyone help me understand where I have gone wrong Ask hosting provide to run your command for you . – Priyank Patel yesterday share|improve this answer answered Mar 13 '14 at 15:42 moshushi 1511210 2 what is the solution http://brrian.net/no-such/unable-to-execute-script.html Why does GCC still seem to work despite bash telling me the gcc command was not found?0How to install a custom GMP lib for just one user?2Why can't I fetch the

Uygunsuz içeriği bildirmek için oturum açın. Yum Install Gcc This problem has so far only been reported on CentOS 7.x and apparently only happens when both the following conditions are met: The version of setuptools initially installed in the Terms Privacy Security Status Help You can't perform that action at this time.

software-installation gcc share|improve this question edited Mar 20 '15 at 22:02 PersianGulf 4,75922652 asked Nov 19 '14 at 16:20 CptSupermrkt 5971819 I would guess that it might have something

Where does x86_64-linux-gnu-gcc appear inside the Makefile? –DanielKO Mar 22 '14 at 17:12 Yes, python-dev is installed. Oturum aç İstatistikler 243 görüntüleme 0 Bu videoyu beğendiniz mi? Please report issues and seek for solutions on the `elasticluster mailing-list`_. Netifaces.c:1:20: Fatal Error: Python.h: No Such File Or Directory What is a real-world metaphor for irrational numbers?

Video kiralandığında oy verilebilir. UNIX is a registered trademark of The Open Group. I have forgotten what the puzzle was How does the unaspirated /t/ differ from /d/? http://brrian.net/no-such/unable-to-execute-due-to-shell-error.html Censure due to holding an Army commission and a seat in Congress What are these boxes mounted inline on each of the 3 phase wires of a high voltage power line

no configure: error: in `/home/mob/freeglut-2.8.0': configure: error: C compiler cannot create executables See `config.log' for more details other i.e gcc --version Unable to exec gcc.real: No such file or directory gcc This is the error I get: Unable to execute gcc: No such file or directory Error: command 'gcc' failed with exit status 1 I'm installing pip within a virtualenv. Next Previous © Copyright 2013-2015, Services and Support for Science IT, University of Zurich. gcc checking whether the C compiler works...

Are zipped exe files harmless for linux servers? Interview question "How long will you stay with us?" Should a colleague receive authorship for identifying a research gap and reviewing a manuscript? Thanks!! –cat pants Mar 23 '14 at 4:45 1 cat pants, please, run the gcc command with -v option added and post its output. Sam D 9.311 görüntüleme 30:13 [Fixed] - Errno::ENOENT: No such file or directory @ rb_sysopen - Süre: 6:25.

Kapat Evet, kalsın. Built with Sphinx using a theme provided by Read the Docs. Please use the mailing-list for further help and for any problem not reported here! Just gcc by itself, with no arguments? –Eliah Kagan Feb 12 '13 at 21:42 ./configure checking for gcc...

and the problem still the same. –X_o Feb 13 '13 at 17:17 @X_o Please edit your question to show the error message and the complete and exact output of Posted by Admin at 5:58 PM No comments: Post a Comment Newer Post Older Post Home Subscribe to: Post Comments (Atom) Followers Subscribe via email Enter your email address: Search Labels RUN apt-get update \ && apt-get install -y --no-install-recommends gcc and-build-dependencies \ && rm -rf /var/lib/apt/lists/* \ && pip install cryptography \ && apt-get purge -y --auto-remove gcc and-build-dependencies # the Join them; it only takes a minute: Sign up Here's how it works: Anybody can ask a question Anybody can answer The best answers are voted up and rise to the

output = open(filename, O_RDWR | O_CREAT, S_IRUSR|S_IWUSR); If you receive an error message about Numeric/arrayobject.h not being found when building Nanoengineer, try running export CPPFLAGS=-I/usr/local/include/python2.7 ./configure make sudo make install If Linked 20 “error: command 'x86_64-linux-gnu-gcc' failed with exit status 1” in virtualenv 2 Pillow repeatedly failed to install in virtualenv: _imaging.o: No such file or directory on Ubuntu Related 123error: command