Home > Unable To > Unable To Create A Checker Cannot Initialize Module Treewalker

Unable To Create A Checker Cannot Initialize Module Treewalker

Contents

I have my own checkstyle rule for my Java project. chrisjenx commented Jan 6, 2016 Oh I upgraded gradle I think Shusshu commented Jan 6, 2016 I'm using the 2.10 and the android gradle 1.5.0 Shusshu commented Jan 6, 2016 Ok In What Order Will These Fill? How to remove Date from output? http://brrian.net/unable-to/unable-to-create-a-checker-cannot-initialize-module.html

Seat assignment on The Canadian What is a real-world metaphor for irrational numbers? Two brothers, two watches Can Mirror Image still work while being grappled? A Page of Puzzling more hot questions question feed lang-xml about us tour help blog chat data legal privacy policy work here advertising info mobile contact us feedback Technology Life / You signed out in another tab or window. http://stackoverflow.com/questions/29136430/error-cannot-initialize-module-treewalker-unable-to-instantiate-junittestcase

Cannot Initialize Module Treewalker Unable To Instantiate Redundantthrows

You seem to have CSS turned off. All Rights Reserved. The plugin definition for 'maven-checkstyle-plugin' in my pom file specifies version 2.10. at org.gradle.api.internal.tasks.execution.ExecuteActionsTaskExecuter.executeActions(ExecuteActionsTaskExecuter.java:69) at org.gradle.api.internal.tasks.execution.ExecuteActionsTaskExecuter.execute(ExecuteActionsTaskExecuter.java:46) at org.gradle.api.internal.tasks.execution.PostExecutionAnalysisTaskExecuter.execute(PostExecutionAnalysisTaskExecuter.java:35) at org.gradle.api.internal.tasks.execution.SkipUpToDateTaskExecuter.execute(SkipUpToDateTaskExecuter.java:64) at org.gradle.api.internal.tasks.execution.ValidatingTaskExecuter.execute(ValidatingTaskExecuter.java:58) at org.gradle.api.internal.tasks.execution.SkipEmptySourceFilesTaskExecuter.execute(SkipEmptySourceFilesTaskExecuter.java:52) at org.gradle.api.internal.tasks.execution.SkipTaskWithNoActionsExecuter.execute(SkipTaskWithNoActionsExecuter.java:52) at org.gradle.api.internal.tasks.execution.SkipOnlyIfTaskExecuter.execute(SkipOnlyIfTaskExecuter.java:53) at org.gradle.api.internal.tasks.execution.ExecuteAtMostOnceTaskExecuter.execute(ExecuteAtMostOnceTaskExecuter.java:43) at org.gradle.execution.taskgraph.DefaultTaskGraphExecuter$EventFiringTaskWorker.execute(DefaultTaskGraphExecuter.java:203) at org.gradle.execution.taskgraph.DefaultTaskGraphExecuter$EventFiringTaskWorker.execute(DefaultTaskGraphExecuter.java:185) at org.gradle.execution.taskgraph.AbstractTaskPlanExecutor$TaskExecutorWorker.processTask(AbstractTaskPlanExecutor.java:62) at org.gradle.execution.taskgraph.AbstractTaskPlanExecutor$TaskExecutorWorker.run(AbstractTaskPlanExecutor.java:50) at org.gradle.internal.concurrent.ExecutorPolicy$CatchAndRecordFailures.onExecute(ExecutorPolicy.java:54) at org.gradle.internal.concurrent.StoppableExecutorImpl$1.run(StoppableExecutorImpl.java:40) Caused

We have enough legacy software in our development process already... –Oliver Kuster Apr 9 '15 at 16:16 2 For new commers: Goto your checkstyle xml and comment out The SuppressWarningsFilter must be configured directly under Checker, not under TreeWalker. Could you use --stacktrace and send me the exception? Cannot Initialize Module Treewalker - Unable To Instantiate Doublecheckedlocking Please don't fill out this field.

cannot initialize module TreeWalker - Unable to instantiate RedundantThrows cannot initialize module TreeWalker - Unable to instantiate RedundantThrows cannot initialize module TreeWalker - Unable to instantiate RedundantThrows cannot initialize module TreeWalker Unable To Instantiate 'catchparametername' Class SourceForge Browse Enterprise Blog Deals Help Create Log In or Join Solution Centers Go Parallel Resources Newsletters Cloud Storage Providers Business VoIP Providers Call Center Providers Home Browse Eclipse Checkstyle Plug-in eclipse.buildId=3.6.3.201411281415-RELEASE-e44 java.version=1.8.0_20 java.vendor=Oracle Corporation BootLoader constants: OS=macosx, ARCH=x86_64, WS=cocoa, NL=en_US Framework arguments: -product org.springsource.sts.ide -keyring /Users/Minearo/.eclipse_keyring -showlocation Command-line arguments: -os macosx -ws cocoa -arch x86_64 -product org.springsource.sts.ide -keyring /Users/Minearo/.eclipse_keyring -showlocation org.eclipse.core.resources check my blog In Checkstyle 5.0, the SuppressWarningsHolderCheck and the SuppressWarningsFilter did not exist yet, as they were introduced in 5.7.

Should a colleague receive authorship for identifying a research gap and reviewing a manuscript? Checkstyle Versions at org.infernus.idea.checkstyle.CheckStylePlugin.processError(CheckStylePlugin.java:340) at org.infernus.idea.checkstyle.checker.CheckFilesThread.run(CheckFilesThread.java:75) Caused by: com.puppycrawl.tools.checkstyle.api.CheckstyleException: cannot initialize module TreeWalker - Unable to instantiate DoubleCheckedLocking at com.puppycrawl.tools.checkstyle.Checker.setupChild(Checker.java:178) at com.puppycrawl.tools.checkstyle.api.AutomaticBean.configure(AutomaticBean.java:184) at org.infernus.idea.checkstyle.checker.CheckerFactory$CheckerFactoryWorker.run(CheckerFactory.java:293) Caused by: com.puppycrawl.tools.checkstyle.api.CheckstyleException: Unable to instantiate DoubleCheckedLocking at com.puppycrawl.tools.checkstyle.PackageObjectFactory.createModule(PackageObjectFactory.java:155) The documentation does not make that part very explicit, although it is there. asked 2 years ago viewed 4549 times active 2 years ago Blog Stack Overflow Gives Back 2016 Developers, Webmasters, and Ninjas: What’s in a Job Title?

Unable To Instantiate 'catchparametername' Class

Reload to refresh your session. https://github.com/checkstyle/checkstyle/issues/1281 Personal Open source Business Explore Sign up Sign in Pricing Blog Support Search GitHub This repository Watch 22 Star 264 Fork 53 jshiell/checkstyle-idea Code Issues 31 Pull requests 0 Projects Cannot Initialize Module Treewalker Unable To Instantiate Redundantthrows What's the meaning of "farmer by trade"? Cannot Initialize Module Treewalker - Unable To Instantiate 'redundantthrows' Class Please don't fill out this field.

Does a byte contain 8 bits, or 9? Check This Out Everything worked as expected but as soon as I introduced, module name="SuppressWarningsHolder" AND/OR module name="SuppressWarningsFilter" to my checkstyle-config.xml, I started to have problems building the project. Linked 0 Checkstyle is not working while building the project in eclipse Related 15Problems occurred when invoking code from plug-in: “org.eclipse.jface” when using Checkstyle Plugin101How to disable a particular checkstyle rule How to select a good sleeping bag liner How to make a shell read the whole script before executing it? Checkstyle Treewalker Error

Errors occurred during the build. Any ideas? Terms Privacy Security Status Help You can't perform that action at this time. Source However, in IDE occurs an error, is it normal behaviour?

Note that the SuppressWarningsHolder does go under TreeWalker. Gradle Checkstyle Version Sever-sort an array Tavern Brawler + Disarm A published paper stole my unpublished results from a science fair Two brothers, two watches Censure due to holding an Army commission and a Thanks.

java checkstyle share|improve this question asked Jan 13 '15 at 10:01 iCode 1,987123163 add a comment| 2 Answers 2 active oldest votes up vote 35 down vote accepted RedundantThrows was removed

Checkstyle-IDEA does not want to run for me anymore :-( 8:04:12 AM CheckstyleException: Checker could not be created.: cannot initialize module TreeWalker - Unable to instantiate DoubleCheckedLocking 8:04:14 AM CheckStylePluginException: An Reload to refresh your session. Owner jshiell commented Jan 22, 2013 Dup of #44. Checkstyle Doublecheckedlocking Checking to see if a string is alphabetic What's the meaning of "farmer by trade"?

share|improve this answer answered Jul 29 '14 at 20:07 Thomas Jensen 7,22653368 I just changed maven-checkstyle-plugin version to 2.8 and moved right under Checker. Interview question "How long will you stay with us?" Why did my credit score plummet in a week? Not the answer you're looking for? have a peek here Any way to get the same check?

You signed in with another tab or window. Note: I realise this is similar to some other questions with the same error (but a different module specified) however I am yet to find a satisfying solution. An idiom or phrase for when you're about to be ill What caused my meringue to fall after adding cocoa? So you must first upgrade your maven-checkstyle-plugin.

Terms Privacy Security Status Help You can't perform that action at this time. chrisjenx commented Nov 4, 2015 FAILURE: Build failed with an exception. * What went wrong: Execution failed for task ':controller:androidCheckstyle'. > Unable to create a Checker: configLocation {file:/Users/chris/Git/OwlrAndroid/controller/build/tmp/android-check/checkstyle.xml}, classpath {null}. * Already have an account? We recommend upgrading to the latest Safari, Google Chrome, or Firefox.

I found the information here; click on the version number, then look under Checkstyle. –Thomas Jensen Jul 29 '14 at 21:31 FYI, the Checkstyle Compatibility Matrix shows which versions When should streams be preferred over traditional loops for best performance? Why is the movie called "Dirty Dancing"? Reload to refresh your session.

You'll need to adapt your configuration and remove modules which do not exist anymore, as pointed out in the release notes: http://eclipse-cs.sourceforge.net/#!/releasenotes If you would like to refer to this comment